Записи с меткой «error»

Страница 1 из 212

PostHeaderIcon RoundCube: Strict Standards: Non-static method PEAR:: setErrorHandling

При установке появляются сообщения

1
2
3
PHP Strict Standards: Non-static method PEAR:: setErrorHandling ( ) should not be called statically in /installer/utils.php on line 80

PHP Strict Standards: Non-static method rcube_install:: get_instance ( ) should <a href="http://www.fairbudget.org/contact-us/">alprazolam xanax</a> not be called statically in /installer/index.php on line 49

Устраняется следующим образом:
Прочитать остальную часть записи »

PostHeaderIcon D-link

Под рукой был dir-615 с прошивкой ver.5.10 для H/W ver.Е4. В этой прошивке нет настроек dual access, так нужных в условиях работы с российскими кабельными провайдерами. Но это пол беды. Трагичность ситуации в том, что стандартным способом роутер напрочь отказывался принимать новую прошивку, аргументируя следующим:

UPLOAD FAILED
The uploaded firmware file may not be correct. You may have uploaded a file that is not intended for this Gateway, or the uploaded file may be corrupted.

If the uploaded file is correct, it is possible that the gateway may be too busy to properly receive it right now. In this case, please try the upload again. It is also possible that you are logged in as a ‘user’ instead of an ‘admin’ — only administrators can upload new firmware.

The Gateway will not be reprogrammed.

Прочитать остальную часть записи »

PostHeaderIcon firefox — python

При очереднм обновлении firefox сборка начала прерываться с сообщением

1
2
3
4
5
6
7
8
9
10
11
12
13
14
15
16
17
18
19
20
21
22
23
24
25
26
27
28
29
30
31
32
33
34
35
36
37
38
39
40
41
42
43
44
45
46
47
48
gmake -C xpcom export
gmake[3]: Вход в каталог `/usr/ports/www/firefox/work/mozilla-release/xpcom'
gmake -C idl-parser export
gmake[4]: Вход в каталог `/usr/ports/www/firefox/work/mozilla-release/xpcom/idl-parser'
/usr/local/bin/python2.6 ../../config/pythonpath.py \
  -I../../other-licenses/ply \
  -I../../xpcom/idl-parser \
  ../../xpcom/idl-parser/header.py --cachedir=. --regen
/usr/ports/www/firefox/work/mozilla-release/other-licenses/ply/ply/yacc.py:2800: DeprecationWarning: the md5 module is deprecated; use hashlib instead
  from md5 import md5
Traceback (most recent call last):
  File "../../config/pythonpath.py", line 52, in <module>
    main(sys.argv[1:])
  File "../../config/pythonpath.py", line 44, in main
    execfile(script, frozenglobals)
  File "../../xpcom/idl-parser/header.py", line 503, in <module>
    p = xpidl.IDLParser(outputdir=options.cachedir)
  File "/usr/ports/www/firefox/work/mozilla-release/xpcom/idl-parser/xpidl.py", line 1457, in __init__
    optimize=1)
  File "/usr/ports/www/firefox/work/mozilla-release/other-licenses/ply/ply/yacc.py", line 3065, in yacc
    signature = pinfo.signature()
  File "/usr/ports/www/firefox/work/mozilla-release/other-licenses/ply/ply/yacc.py", line 2800, in signature
    from <a href="http://anthillfilms.com/films/">cialis vs viagra</a> md5 import md5
  File "/usr/local/lib/python2.6/md5.py", line 10, in <module>
    from hashlib import md5
  File "/usr/local/lib/python2.6/hashlib.py", line 136, in <module>
    md5 = __get_builtin_constructor('md5')
  File "/usr/local/lib/python2.6/hashlib.py", line 63, in __get_builtin_constructor
    import _md5
ImportError: No module named _md5
gmake[4]: *** [export] Ошибка 1
gmake[4]: Выход из каталога `/usr/ports/www/firefox/work/mozilla-release/xpcom/idl-parser'
gmake[3]: *** [export] Ошибка 2
gmake[3]: Выход из каталога `/usr/ports/www/firefox/work/mozilla-release/xpcom'
gmake[2]: *** [export_tier_platform] Ошибка 2
gmake[2]: Выход из каталога `/usr/ports/www/firefox/work/mozilla-release'
gmake[1]: *** [tier_platform] Ошибка 2
gmake[1]: Выход из каталога `/usr/ports/www/firefox/work/mozilla-release'
gmake: *** [default] Ошибка 2
*** Error code 1

Stop in /usr/ports/www/firefox.
*** Error code 1

Stop in /usr/ports/www/firefox.

===>>> make failed for www/firefox
===>>> Aborting update

Разбираться не стал, пересобрал python (у меня стоит python26, менять не стал)

1
$ sudo portmaster -d www/firefox

заработало.

PostHeaderIcon Opera

В один прекрасный момент случилось страшное — нативная опера на freebsd перестала запускаться с ошибкой следующего содержания

1
2
3
4
5
6
7
8
9
10
11
12
13
./opera
Opera(23016)/kdeui (KIconLoader): Unable to find an appropriate lock to guard the shared cache.  This *should* be essentially impossible. :(
Opera(23016)/kdeui (KIconLoader): Unable to perform initial setup, this system probably does not really support process-shared pthreads or semaphores, even though it claims otherwise.
Opera(23016): Session bus not found
To circumvent <a href="http://rentiaa.com/">VolumePills</a> this problem try the following command (with Linux and bash)
export $(dbus-launch)

KCrash: Application 'Kde4ToolkitLibrary' crashing...
KCrash: Attempting to start /usr/local/bin/drkonqi from kdeinit
sock_file=/home/lycane/.kde4/socket-lycane.mlcom.pvt/kdeinit4__0
Warning: connect() failed: : Connection refused
KCrash: Attempting to start /usr/local/bin/drkonqi directly
QSettings::sync: filename is null/empty

Прочитать остальную часть записи »

PostHeaderIcon x11keyfaker.cpp error

Возникновение такой ошибки

1
2
3
4
5
6
7
8
9
10
x11keyfaker.cpp:48:34: error: X11/extensions/XTest.h: No such file or directory
x11keyfaker.cpp: In member function ‘void X11KeyFaker::sendKeyEvent(int, bool)’:
x11keyfaker.cpp:449: error: ‘XTestFakeKeyEvent’ was not declared in this scope
x11keyfaker.cpp:452: error: ‘XTestFakeKeyEvent’ was not declared in this scope
x11keyfaker.cpp:456: error: ‘XTestFakeKeyEvent’ was not declared in this scope
x11keyfaker.cpp:459 <a href="http://urbanjazzcoalition.com/">VigRX</a>: error: ‘XTestFakeKeyEvent’ was not declared in this scope
x11keyfaker.cpp:464: error: ‘XTestFakeKeyEvent’ was not declared in this scope
x11keyfaker.cpp: In member function ‘void X11KeyFaker::connect()’:
x11keyfaker.cpp:550: error: ‘XTestQueryExtension’ was not declared in this scope
make: *** [.obj/release-shared/x11keyfaker.o] Ошибка 1

при сборке qt4 говорит нам о том, что не установлена библиотека x11/libXtst.
Ну и устраняется ошибка, конечно же, простыми действиями

1
cd /usr/ports/x11/libXtst && make install clean

PostHeaderIcon Skype:

Со вчерашнего утра масса народа сталкивается с проблемой, состоящей в том, что клиент skype не может залогиниться на свой сервер. На сайте самого Skype есть ссылка на блог, которое, будучи установленным, эту проблему решает. В общем, если у вас поломался Skype, то качаем отсюда и устанавливаем обновление. А Мелкософт тут не при чем, да :) Правда, симптоматично, что поломались клиенты только под Microsoft. Linux клиенты нормально логинятся без обновления.

PostHeaderIcon Fatal error: Unknown: apc_fcntl_unlock failed: in Unknown on line 0

Собрал систему:

1
FreeBSD login.test.pvt 8.2-STABLE FreeBSD 8.2-STABLE #0: Thu May 19 23:20:12 VOLST 2011     denis@login.test.pvt:/usr/obj/usr/src/sys/GENERIC  i386

установил phpmyadmin, при попытке входа в него получаю сообщение об ошибке:

1
Fatal error: Unknown: apc_fcntl_unlock failed: in Unknown on <a href="http://amahouston.net/page/2/">Levitra</a> line 0

Как выяснилось, вообще все php-скрипты таким образом жалуются. Гугление дало следующий результат: www/pecl-APC должен быть собран с опцией semafores
так что Прочитать остальную часть записи »

PostHeaderIcon eAccelerator: shmmax should be at least 2MB

Воевала я целых полчаса в безрезультатных попытках запустить apache вместе с этим ускорителем. Ничего не помогало. Но неожиданно решение было найдено. Вот оно:
Пишем в sysctl.conf

1
2
kern.ipc.shmall=65536
kern.ipc.shmmax=268435456

И в конфиг eaccelerator’а добавлена строчка

1
eaccelerator.shm_max="32"

Значение должно быть больше 2Мб, рекомендуемое где-то между 16Мб и 32Мб.

PostHeaderIcon Kaspersky Antivirus

После удаления из системы (MS Windows XP) Kaspersky Antivirus перестала определяться мышь, как USB так и PS/2.
Решение: запускаем перестала определяться мышь, как USB так и PS/2.
Решение: запускаем regedit, идем в HKLM\SYSTEM\CurrentControlSet\Control\Class\{4D36E96F-E325-11CE-BFC1-08002BE10318}, находим там ключ UpperFilter и присваиваем ему значение mouclass. Ничего другого там быть не должно, Kaspersky Antivirus пихает туда klmouflt.

PostHeaderIcon (httpd), uid 80: exited on signal 11

На просторах интернетов можно встретить достаточно много описаний, почему происходит такое:

1
(httpd), uid 80: exited on signal 11

Чаще всего — из-за подгружаемых модулей php. В моём случае апач стал вываливаться в корку после установки xcache. Но небольшая настройка спасла ситуацию :)
Прочитать остальную часть записи »

PR-CY.ru